Home > No Such > Gcc Error Trying To Exec 'cc1obj'

Gcc Error Trying To Exec 'cc1obj'

Contents

Hello, So I'm learning how to program in Objective C. Anyway, you did not quote the actual reason for rthe failing build, it was not >> gcc version 5.2.1 20150808 (Debian 5.2.1-15) >> configure:20014: $? = 0 >> configure:20003: gcc -V CentOS How to install Univention Corporate Server Linux tutorials POPULAR CATEGORYLinux distributions1474Software570Linux tutorials457News427Frequently Asked Questions313Opensource268Releases138CentOS118Unix113 ABOUT USUnixmen provide Linux Howtos, Tutorials, Tips & Tricks ,Opensource News. configure: exit 1 -- System Information: Debian Release: stretch/sid APT prefers unstable APT policy: (500, 'unstable') Architecture: amd64 (x86_64) Kernel: Linux 3.19.0-23-generic (SMP w/8 CPU cores) Locale: LANG=en_US.UTF-8, LC_CTYPE=en_US.UTF-8 (charmap=UTF-8) Shell: http://bloggingsystemsblog.com/no-such/gcc-error-trying-to-exec-cc1obj-execvp.html

It will probably be one of: g++-4.1 g++-4.2 g++-4.3 cheers, jdk jdkaye View Public Profile View LQ Blog View Review Entries View HCL Entries Find More Posts by jdkaye 04-03-2009, A book called "The Zone" How do you indicate that an item is not selectable? UNIX is a registered trademark of The Open Group. Directory pointed explicitly0Cross-compilation: error trying to exec 'cc1': execvp: No such file or directory3gcc error trying to exec 'cc1': execvp: No such file or directory when running with non-root user0“msp430-gcc: error http://stackoverflow.com/questions/8593562/how-to-compile-objc-code-on-linux

Gcc: Error Trying To Exec 'cc1plus': Execvp: No Such File Or Directory Centos

Copy sent to Debian Pkg-e Team . (Mon, 28 Dec 2015 12:00:03 GMT) Full text and rfc822 format available. Also I'm eventually going to start writing code for the iphone, so could the set up also closely mimic compiling code on the mac, that would be great. so the elegant way is just to gcc hello.m `gnustep-config --objc-flags` -lgnustep-base -o hello now it should be okay. Other computers don't have this problem.

Join our community today! Is the study of proper names really a branch of linguistics? I don't have it. Fatal Error: Sasl/sasl.h: No Such File Or Directory In fact, after the experience with C, C++ and Java, there should not be any programming language that is particularly hard except for those functional ones which I have absolutely no

A book called "The Zone" Should immortal women have periods? However, rather than going up a directory and then back down, remember that '.' is always equivalent to the current directory. cu Andreas -- `What a good friend you are to him, Dr. I recommend reading this post: Starting iPhone app development in Linux? –Jeremy Dec 21 '11 at 17:21 add a comment| 2 Answers 2 active oldest votes up vote 8 down vote

Please visit this page to clear all LQ-related cookies. Sasl/saslwrapper.h:22:23: Fatal Error: Sasl/sasl.h: No Such File Or Directory If you need to reset your password, click here. Related 18Compiling Objective-C project on Linux (Ubuntu)801How to symlink a file in Linux?0objective c linux compile script0Python Compilation Error for Code implemented on Windows and trying to run on Linux126How do Registration is quick, simple and absolutely free.

Install Gcc-c++

LinuxQuestions.org > Forums > Linux Forums > Linux - Newbie gcc: error trying to exec 'cc1plus': execvp: No such file or directory- Fedora 10 User Name Remember Me? more stack exchange communities company blog Stack Exchange Inbox Reputation and Badges sign up log in tour help Tour Start here for a quick overview of the site Help Center Detailed Gcc: Error Trying To Exec 'cc1plus': Execvp: No Such File Or Directory Centos What now? Src/mplutils.h:21:20: Fatal Error: Python.h: No Such File Or Directory Request was from Andreas Metzler to [email protected] (Sun, 27 Dec 2015 13:08:50 GMT) Full text and rfc822 format available.

share|improve this answer answered Feb 29 at 12:56 sfrank 1 add a comment| up vote 0 down vote You can fix that by running this: On Fedora: sudo dnf install redhat-rpm-config check my blog Was it installed in your > build-environment? > That was #796494. Why would a crash landed generation fall back to the stone age? Page 1 of 2 12 Last Jump to page: Results 1 to 10 of 17 Thread: Need help with compiling Objective C code. Fatal Error: Sql.h: No Such File Or Directory

Is there something under terminal I have to do? A book called "The Zone" Combination of lists elementwise How is the Riemann zeta function equal to 0 at -2, -4, et cetera? You've come quite close to solving it by yourself. http://bloggingsystemsblog.com/no-such/gcc-error-trying-to-exec-jc1.html Request was from Julien Cristau to [email protected] (Mon, 28 Dec 2015 12:00:03 GMT) Full text and rfc822 format available.

It sucked. G++ Centos Join them; it only takes a minute: Sign up Gcc error: gcc: error trying to exec 'cc1': execvp: No such file or directory up vote 18 down vote favorite 2 I Maturin.

objective-c linux compilation share|improve this question asked Dec 21 '11 at 17:07 JAM 24.8k79236373 1 Just a heads up: you cannot compile code that uses Apple's Cocoa classes.

What reason could change people's mentality to treat each other as members of one kind? How do you prove that mirrors aren't parallel universes? Comment 3 Richard Biener 2011-04-20 09:44:34 UTC You need to install the corresponding gfortran package. Taskset Execvp: No Such File Or Directory CC kernel/bounds.s gcc: error trying to exec 'cc1': execvp: No such file or directory make[1]: *** [kernel/bounds.s] Error 1 make: *** [prepare0] Error 2 I figured that the problem was that

Visit the following links: Site Howto | Site FAQ | Sitemap | Register Now If you have any problems with the registration process or your account login, please contact us. What is the easiest way to obtain all 3 starters in Pokemon Sun/Moon Why are there two kernels under `/lib/modules` on 16.04 LTS? more hot questions question feed about us tour help blog chat data legal privacy policy work here advertising info mobile contact us feedback Technology Life / Arts Culture / Recreation Science have a peek at these guys Exactly what executables?

Not the answer you're looking for? Acknowledgement sent to Julien Cristau : Extra info received and forwarded to list. However, other builders seem to > build it fine without the apparently missing build-dep (gobjc-*?). > Perhaps there's something that makes configure take this branch on my > config, or it's knudfl View Public Profile View LQ Blog View Review Entries View HCL Entries Find More Posts by knudfl 04-03-2009, 07:59 PM #4 AtmoHawk03 LQ Newbie Registered: Mar 2009 Distribution:

Join Date Aug 2007 Beans 185 Re: Need help with compiling Objective C code. Possibly because they put '.' in the $PATH variable. Nevermind, I mixed up version numbers. I had one once.

Thanks for giving some rescue tips. \jc Comment 1 Jonathan Wakely 2011-04-20 09:12:52 UTC http://gcc.gnu.org/bugs/#need Comment 2 crivello 2011-04-20 09:32:56 UTC What you need * the exact version of GCC; gcc Re: Need help with compiling Objective C code. Adv Reply March 19th, 2009 #7 MR.UNOWEN View Profile View Forum Posts Private Message Frothy Coffee! Compiling Objective C requires a package that isn't part of the standard install (or part of the "build-essential" package): Code: sudo apt-get install gobjc-4.3 (or install the package "gobjc-4.3" via the

Cheers, Julien [signature.asc (application/pgp-signature, inline)] Added tag(s) stretch. sudo apt-get install gnustep sudo apt-get install gnustep-devel 3.After you have done the above steps, copy the following code(in case you have no idea of what this is doing now, it What cross-compiler did you install and where did you install it? –Gilles Dec 21 '13 at 1:05 | show 4 more comments 1 Answer 1 active oldest votes up vote 3 Is there a simpler way to find an inverse of a congruence?

Requirement to use a spatial database - Why use a spatial database? gcc version 5.2.1 20150808 (Debian 5.2.1-15) configure:20014: $? = 0 configure:20003: gcc -V >&5 gcc: error: unrecognized command line option '-V' gcc: fatal error: no input files compilation terminated.